{"text_format":"1","workbook":"xlsx","n_sheets":12,"sheets":["Erläuterung","Tabellenkonfiguration","Anschreiben","Warenkorb","Wertart","Metrische Felder","Metrische Felder_ALT","Merkmale","Merkmale_ALT","Merkmalsauspraegungen","Merkmalsauspraegungen_ALT","Filterinterpretation"],"not_rendered":{"charts":0,"images":7,"macros":1,"external_links":0,"defined_names":162,"comments":0,"pivot_tables":0},"unopened":[],"bounds":{"document_bytes":16777216,"sheet_cells":100000,"rows_first":2000,"rows_last":500,"rows_between":2000,"halvings":0,"cell_chars":16384,"cell_head_chars":4096},"cells_cut":0,"cells_raw":0,"read":"whole","date_system":"1900"}

{"sheet":"Erläuterung","index":0,"n_rows":44,"n_cols":3,"rows_kept":44,"cut":false,"hidden":false,"merged":[]}
["Das MS EXCEL-Tool „Tabellenkonfigurator.xlsm“ ist ein Instrument zur Konfiguration von Tabellen, mit deren Befüllung Sie uns beauftragen können: Sie geben die Tabellenstruktur vor und wir nehmen mit der Forschungsdatenbank "]
["des Projekts ENOB:dataNWG die Berechnungen vor."]
[]
["Das MS EXCEL-Tool „Tabellenkonfigurator.xlsm“ besteht aus drei (sichtbaren) Tabellenblättern: Neben dem vorliegenden Tabellenblatt „Erläuterung“ sind dies die Tabellenblätter „Tabellenkonfiguration“ und „Warenkorb“."]
[]
["Die Konfiguration von Tabellen nach Ihren Vorstellungen nehmen Sie im Tabellenblatt „Tabellenkonfiguration“ vor."]
["Im Abschnitt „Filter“ haben Sie die Möglichkeit, die Untersuchungsgesamtheit mittels Filtersetzung zu spezifizieren. Beim Verzicht auf das Setzen von Filtern erstreckt sich die von Ihnen konfigurierte Tabelle auf die Grundgesamtheit "]
["aller funktional relevanter Nichtwohngebäude, deren (hochgerechnete) Gesamtzahl das Projekt ENOB:dataNWG auf 2,943 Mio. (+/- 0,208 Mio.) beziffert. Durch das Setzen eines Filters definieren Sie eine Teilmenge dieser"]
["Grundgesamtheit. Einen Filter setzen Sie, indem Sie aus der Dropdown-Liste eine als Filtermerkmal fungierende Variable und in der rechts daneben angeordneten Dropdown-Liste die gewünschte Ausprägung auswählen."]
["Aus Platzgründen weist die Dropdown-Liste der Filtermerkmale nur Variablennamen und die Dropdown-Liste der Ausprägungen nur Zahlencodes aus. Was sich hinter den Variablennamen und den Zahlencodes der Ausprägungen verbirgt,"]
["entnehmen Sie bitte dem Dokument „Variablendokumentation Fernrechnen“, das Ihnen als Download zur Verfügung steht."]
["Durch das Setzen von Filtern können Sie bis zu vier verschiedene Teilmengen definieren. Solange diese Teilmengen überlappen (mengentheoretisch ausgedrückt also nicht-leere Schnittmengen bilden), haben Sie unter „Filterverknüpfung“ "]
["die Möglichkeit festzulegen, ob die zu analysierenden Gebäude in allen Teilmengen enthalten sein müssen („Schnittmenge“) oder ob bereits eine Zugehörigkeit zu einer einzigen Teilmenge genügt („Vereinigungsmenge“)."]
["Im Abschnitt „Merkmale“ können Sie aus Dropdown-Listen Tabellierungsmerkmale auswählen. Möglich sind ein vertikales und ein horizontales Tabellierungsmerkmal."]
["Unter Umständen wählen Sie aus der Dropdown-Liste ein sog. nachgelagertes Merkmal aus. Hierbei handelt es sich um ein Merkmal, das nur für diejenigen Gebäude gültige Merkmalsausprägungen aufweist, die bei übergeordneten "]
["Merkmalen bestimmte Ausprägungen einnehmen. Wenn Sie ein nachgelagertes Merkmal auswählen, weist Sie das Programm darauf hin, einen entsprechenden Filter zu setzen. Welcher Filter zu setzen ist, entnehmen"]
["Sie der Variablendokumentation. Sollten Sie der Aufforderung nach dem Setzen eines Filters nicht nachkommen, setzen wir den entsprechenden Filter."]
[]
["Beispiel: Sie wählen als Tabellierungsmerkmal die Variable „Anbau_jk“ (Altersklasse der Fertigstellung der nachträglichen Gebäudeerweiterung). Merkmalsausprägungen liegen dabei (sinnvollerweise) nur für Gebäude vor, die durch"]
["                   Anbauten nachträglich erweitert wurden, d.h. für die q6 = 1 ist (siehe Variablendokumentation zur Variable „Anbau_jk“). Folglich wählen Sie bitte als Filtermerkmal q6 und als Ausprägung „1“."]
[]
["Im Abschnitt „Ausgabe“ legen Sie fest, womit die Tabelle befüllt werden soll. Wenn Sie „Anzahl“ wählen, stellen wir Ihnen absolute Häufigkeiten zur Verfügung. Die Tabelle weist dann nach, wie sich die hochgerechnete Zahl der Gebäude"]
["der von Ihnen spezifizierten Untersuchungsgesamtheit entlang Ihrer Tabellierungsmerkmale aufspaltet. Wählen Sie dagegen „Anteil“, erhalten Sie relative Häufigkeiten (d.h. Prozentwerte). Bei der Option „Anteil“ müssen Sie sich zusätzlich"]
["entscheiden,"]
["- ob sich die Prozentwerte insgesamt zu 100 % aufaddieren sollen („Anteil - Zellenprozente“). "]
["- ob sich die Prozentwerte entlang einer Tabellenzeile zu 100 % aufaddieren sollen („Anteil - Zeilenprozente“). "]
["- ob sich die Prozentwerte entlang einer Tabellenspalte zu 100 % aufaddieren sollen („Anteil - Spaltenprozente“). "]
["Anstelle von (absoluten oder relativen) Häufigkeiten können Sie auch „Mittelwert“ wählen. In diesem Fall weist die Tabelle Mittelwerte eines metrischen Merkmals aus, das Sie in dem darunter liegenden Feld spezifizieren müssen."]
["Zum Schluss noch eine Besonderheit: Verzichten Sie im Abschnitt „Merkmale“ auf die Vorgabe von Tabellierungsmerkmalen, sind im Abschnitt „Ausgabe“ nur die Optionen „Anzahl“ und „Mittelwert“ möglich. In diesem Fall enthält"]
["die konfigurierte Tabelle nur einen einzigen Wert, nämlich entweder die (hochgerechnete) Anzahl der Gebäude in der von Ihnen festgelegten Untersuchungsgesamtheit oder den untersuchungsgesamtheitsbezogenen Mittelwert des"]
["von Ihnen vorgegebenen metrischen Merkmals."]
[]
["Wenn Sie den Button „Vorschau“ anklicken, wird Ihnen angezeigt, wie die von Ihnen konfigurierte Tabelle aussieht und welche Kosten (ohne MwSt.) auf Sie zukommen, wenn Sie diese Tabelle von uns erstellen lassen möchten. Entspricht"]
["diese Tabelle noch nicht Ihren Vorstellungen, passen Sie bitte Ihre Konfiguration entsprechend an, bis die gewünschte Tabellenstruktur in der Vorschau erscheint. "]
[]
["Sind Sie mit der Vorschau zufrieden, können Sie die Tabelle über die Betätigung des Buttons „Warenkorb“ in den Warenkorb legen."]
[]
["Das Tabellenblatt „Warenkorb“ weist alle Tabellenkonfigurationen aus, die Sie in den Warenkorb gelegt haben. Über den Button „Position entfernen“ in Verbindung mit dem darunter liegenden Auswahlfeld  können Sie einzelne Tabellen"]
["aus dem Warenkorb entfernen oder den Warenkorb vollständig entleeren. Durch Anklicken des Buttons „Bestellen“ erzeugt das Programm ein Bestellformular im pdf-Format, in dem alle bestellten Tabellen aufgelistet sind. Bitte "]
["kontrollieren Sie das Bestellformular, tragen Sie Ihre Kontaktdaten ein, unterschreiben Sie es und schicken Sie es uns zu, und zwar entweder eingescannt als Mailanhang an fernrechnen@iwu.de oder per Fax an 06151/290497."]
[]
["Falls Sie inhaltliche oder technische Fragen zum Tabellenkonfigurator haben, stehen wir Ihnen gerne unter fernrechnen@iwu.de oder telefonisch zur Verfügung:"]
["Dr. Holger Cischinsky:",null,"+49-6151-2904-37"]
["Hendrik Schäfer:",null,"+49-6151-2904-30"]

{"sheet":"Tabellenkonfiguration","index":1,"n_rows":31,"n_cols":10,"rows_kept":31,"cut":false,"hidden":false,"merged":[]}
[]
[]
[]
[]
[]
[null,"Selektion","Unterselektion"]
[]
["Filter","Merkmal","Ausprägung","Filter schränken die Grundgesamtheit ein. Sie sind rein optional."]
["Filter 1"]
["Filter 2",null,null,null,"Falls mehrere unterschiedliche Filtermerkmale ausgewählt werden, ist die Art der Filterverknüpfung festzulegen."]
["Filter 3",null,null,null,"Ohne Festlegung wird standardmäßig die Schnittmenge gebildet."]
["Filter 4",null,null,null,"Falls ein Merkmal mehrmals gewählt wird, so ist die Verknüpfung Vereinigungsmenge obligatorisch."]
["Filterverknüpfung"]
[{"$f":"_xlfn.IFNA(IF(J14>0,\"*Achtung: Nachgelagerte Merkmale\"&CHAR(10)&\"vorhanden. Bitte Filter\"&CHAR(10)&\"entsprechend einschränken.\"&CHAR(10)&\"Ggf. erfolgt dies durch das IWU.\",\"\"),\"\")","v":""},null,null,null,{"$f":"_xlfn.NUMBERVALUE(_xlfn.IFNA(VLOOKUP($B17,Merkmale!$A$2:'Merkmale'!$C$150,3,FALSE),0))","v":0},{"$f":"_xlfn.NUMBERVALUE(_xlfn.IFNA(VLOOKUP($B18,Merkmale!$A$2:'Merkmale'!$C$150,3,FALSE),0))","v":0},{"$f":"_xlfn.NUMBERVALUE(_xlfn.IFNA(VLOOKUP($B19,Merkmale!$A$2:'Merkmale'!$C$150,3,FALSE),0))","v":0},{"$f":"_xlfn.NUMBERVALUE(_xlfn.IFNA(VLOOKUP($B20,Merkmale!$A$2:'Merkmale'!$C$150,3,FALSE),0))","v":0},{"$f":"_xlfn.NUMBERVALUE(_xlfn.IFNA(VLOOKUP($B24,'Metrische Felder'!$A$2:'Metrische Felder'!$B$33,2,FALSE),0))","v":0},{"$f":"SUM(E14:I14)","v":0}]
[null,null,null,null,"Größe vertikal","Größe horizontal","Anzahl vert. Header","Anzahl horiz. Header"]
["Merkmale"]
["Vertikales Merkmal 1",null,{"$f":"_xlfn.IFNA(IF(E14>0,\"*Nachgelagertes Merkmal\",\"\"),\"\")","v":""},null,{"$f":"IFERROR(VLOOKUP($B17,Merkmale!$A$3:$B$150,2,FALSE),1)","v":1},1,{"$f":"IF(ISBLANK($B$17),0,2) + IF(ISBLANK($B$18),0,2)","v":0},{"$f":"IF(ISBLANK($B$19),0,2) + IF(ISBLANK($B$20),0,2)","v":0}]
["Vertikales Merkmal 2",null,{"$f":"_xlfn.IFNA(IF(F14>0,\"*Nachgelagertes Merkmal\",\"\"),\"\")","v":""},null,{"$f":"IFERROR(VLOOKUP($B18,Merkmale!$A$3:$B$150,2,FALSE),1)","v":1},1]
["Horizontales Merkmal 1",null,{"$f":"_xlfn.IFNA(IF(G14>0,\"*Nachgelagertes Merkmal\",\"\"),\"\")","v":""},null,1,{"$f":"IFERROR(VLOOKUP($B19,Merkmale!$A$3:$B$150,2,FALSE),1)","v":1}]
["Horizontales Merkmal 2",null,{"$f":"_xlfn.IFNA(IF(H14>0,\"*Nachgelagertes Merkmal\",\"\"),\"\")","v":""},null,1,{"$f":"IFERROR(VLOOKUP($B20,Merkmale!$A$3:$B$150,2,FALSE),1)","v":1}]
[]
["Ausgabe"]
["Ausgabeart","Anzahl"]
["Metrisches Merkmal","--","Nur bei Ausgabeart \"Mittelwert\" gestattet."]
[null,{"$f":"_xlfn.IFNA(IF(I14>0,\"*Nachgelagertes Merkmal\",\"\"),\"\")","v":""}]
["Tabellengröße Kerndaten"]
["Vertikal",{"$f":"PRODUCT($E$17:$E$20)","v":1}]
["Horizontal",{"$f":"PRODUCT($F$17:$F$20)","v":1}]
[]
[null,null,null,"Kosten:",40]
[null,null,null,"Ihre konfigurierte Tabelle wird die unten angezeigte Struktur haben. Eine analoge Tabelle mit den zugehörigen Standardfehlern wird ebenfalls bereitgestellt."]

{"sheet":"Anschreiben","index":2,"n_rows":165,"n_cols":9,"rows_kept":165,"cut":false,"hidden":true,"merged":[[54,0,54,4],[56,0,56,4],[57,0,57,4],[59,0,59,4],[62,0,62,4],[61,0,61,4],[122,0,122,4],[64,0,64,4],[65,0,65,4],[67,0,67,4],[68,0,68,4],[70,0,70,4],[71,0,71,4],[73,0,73,4],[74,0,74,4],[76,0,76,4],[77,0,77,4],[120,0,120,4],[139,0,139,4],[124,0,124,4],[126,0,126,4],[127,0,127,4],[129,0,129,4],[130,0,130,4],[131,0,131,4],[132,0,132,4],[134,0,134,4],[135,0,135,4],[137,0,137,4],[138,0,138,4],[155,0,155,4],[140,0,140,4],[141,0,141,4],[143,0,143,4],[144,0,144,4],[145,0,145,4],[146,0,146,4],[148,0,148,4],[149,0,149,4],[151,0,151,4],[152,0,152,4],[154,0,154,4],[163,0,163,4],[164,0,164,4],[156,0,156,4],[157,0,157,4],[158,0,158,4],[159,0,159,4],[160,0,160,4],[161,0,161,4]]}
["Institut Wohnen und Umwelt GmbH"]
["Rheinstraße 65"]
["64295 Darmstadt",null,null,null,null,null,null,null,"Institut Wohnen"]
[null,null,null,null,null,null,null,null,"und Umwelt GmbH "]
[null,null,null,null,null,null,null,null,"Forschungseinrichtung"]
[null,null,null,null,null,null,null,null,"des Landes Hessen und"]
[null,null,null,null,null,null,null,null,"der Stadt Darmstadt"]
[]
[null,null,null,null,null,null,null,null,"Rheinstraße 65"]
[null,null,null,null,null,null,null,null,"64295 Darmstadt"]
[null,null,null,null,null,null,null,null,"Germany"]
[null,null,null,null,null,null,null,null,"Tel: +49 (0)6151 / 2904-0"]
[null,null,null,null,null,null,null,null,"Fax: +49 (0)6151 / 2904-97"]
[null,null,null,null,null,null,null,null,"info@iwu.de"]
["Anschrift des Bestellers (bitte ausfüllen):",null,null,null,null,null,null,null,"www.iwu.de"]
[]
[]
["__________________________________________________________________________________"]
["(Firma oder Organisation; ggf. Abteilung o.ä.)"]
[]
["__________________________________________________________________________________"]
["(Vorname und Zuname)"]
[]
["__________________________________________________________________________________"]
["(Straße + Hausnummer)"]
[]
["__________________________________________________________________________________"]
["(PLZ, Ort)"]
[]
["__________________________________________________________________________________"]
["(Land)"]
[]
["__________________________________________________________________________________"]
["(Telefonnummer)"]
[]
["__________________________________________________________________________________"]
["(E-Mail-Adresse)"]
[]
["Anzahl bestellter Auswertungstabellen:",null,null,null,{"$f":"Warenkorb!B1","v":0}]
[]
["Grundpauschale (netto):",null,null,null,{"$f":"Warenkorb!B2","v":25}]
["Kosten bestellter Auswertungstabellen (netto):",null,null,null,{"$f":"Warenkorb!B3","v":0}]
["___________________________________________________________________"]
["Gesamtpreis (netto):",null,null,null,{"$f":"Warenkorb!B4","v":25},"[Betrag netto]"]
["Gesamtpreis (zuzüglich gesetzlicher MwSt. (7 %)):",null,null,null,{"$f":"Warenkorb!B5","v":26.75}]
[]
["___________________________________________________________________"]
["(Ort, Datum, Unterschrift Besteller)"]
[]
["Indem Sie das vollständige Bestellformular ausgefüllt und unterschrieben postalisch, "]
["per Fax (Fax-Nr. rechts stehend) oder per E-Mail (an: fernrechnen@iwu.de) an die "]
["Institut Wohnen und Umwelt GmbH schicken, lösen Sie einen verbindlichen, "]
["kostenpflichtigen Bestellvorgang aus. Gleichzeitig erklären Sie sich mit den auf den "]
["Folgeseiten abgedruckten Bestellbedingungen einverstanden."]
["Bestellbedingungen"]
[]
["§ 1  Leistungsumfang"]
["Die Institut Wohnen und Umwelt GmbH berechnet die vom Besteller auf den ab Seite 6 dieses Bestellformulars mithilfe des Tabellenkonfigurators konfigurierten Auswertungstabellen (incl. Standardfehler). Eine Erläuterung und Interpretation der berechneten Auswertungstabellen durch die Institut Wohnen und Umwelt GmbH zählt nicht zum Leistungsumfang."]
[]
["Tabellen, die mehrfach bestellt werden, die aufgrund ihrer Konfiguration nicht mit Werten befüllt werten können (insbesondere, weil der Besteller durch die Filtersetzung eine Teilmenge der Grundgesamtheit definiert wird, für die es keine Gebäudedatensätze gibt) oder die aus Datenschutzgründen vollständig nicht weitergegeben werden dürfen, werden nicht in Rechnung gestellt. Können dagegen nur einzelne Tabellenwerte aus Datenschutzgründen nicht weitergegeben werden, wird der Tabellenpreis dennoch in voller Höhe in Rechnung gestellt."]
[]
["§ 2  Haftungsausschluss"]
["Die Institut Wohnen und Umwelt GmbH versichert, dass die Erstellung der Datenbank und die Berechnung der bestellten Tabellen sorgfältig und nach wissenschaftlichen Regeln erfolgt. Für eventuell dennoch entstandene oder entstehende Fehler in der Datenbank oder bei der Berechnung der Tabellen übernimmt die Institut Wohnen und Umwelt GmbH keine Haftung."]
[]
["§ 3  Bearbeitungsdauer"]
["Die Bearbeitungszeit richtet sich nach der Arbeitsorganisation und Bearbeitungskapazität der Institut Wohnen und Umwelt GmbH. Sollte eine Bestellung nicht innerhalb von vier Wochen nach Eingang des Bestellformulars bearbeitet werden können, kann der Besteller seine Bestellung widerrufen. Der Widerruf ist der Institut Wohnen und Umwelt GmbH vom Besteller formlos, aber auf schriftlichem Wege (postalisch, per Email oder per Fax) zu erklären."]
[]
["§ 4  Rechnungsbetrag"]
["Der auf Seite 1 des Bestellformulars ausgewiesene Rechnungsbetrag wird entsprechend reduziert, falls aus den in § 1 genannten Gründen Auswertungstabellen nicht zur Verfügung gestellt werden (können). Die Grundpauschale bleibt dagegen in unveränderter Höhe bestehen. Sie entfällt nur dann, wenn aus den in § 1 genannten Gründen überhaupt keine Auswertungstabelle zur Verfügung gestellt werden kann."]
[]
["§ 5  Verpflichtungen des Bestellers"]
["Der Besteller verpflichtet sich, bei (auch teilweiser) Veröffentlichung oder anderweitiger Nutzung einer Auswertungstabelle die zugrunde liegende Datenquelle in folgendem Wortlaut anzugeben: Sonderauswertung der Forschungsdatenbank des Projekts „Forschungsdatenbank Nichtwohngebäude (ENOB:dataNWG)“ (gefördert durch das Bundesministerium für Wirtschaft und Energie; Förderkennzeichen: 03ET1315)."]
[]
["§ 6  Datenschutz"]
["Es wird auf die Anlage „Informationspflichten nach der Datenschutzgrundverordnung (DSGVO) gegenüber Vertragspartnern und Vertragsinteressenten (vorvertragliches Schuldverhältnis) gem. Art. 13 DSGVO“ verwiesen."]
[]
["§ 7  Erfüllungsort und Gerichtsstand"]
["Erfüllungsort und Gerichtsstand ist Darmstadt."]
[]
[]
[]
[]
[]
[]
[]
[]
[]
[]
[]
[]
[]
[]
[]
[]
[]
[]
[]
[]
[]
[]
[]
[]
[]
[]
[]
[]
[]
[]
[]
[]
[]
[]
[]
[]
[]
[]
[]
[]
[]
[]
{"$rows_left_out":46}
{"sheet":"Warenkorb","index":3,"n_rows":7,"n_cols":4,"rows_kept":7,"cut":false,"hidden":false,"merged":[]}
["Anzahl Positionen:",0]
["Grundpauschale (netto):",25]
["Kosten Tabellen (netto):",{"$f":"SUM(D:D)","v":0}]
["Gesamtpreis (netto)",{"$f":"B3+B2","v":25}]
["Gesamtpreis zzgl. MwSt.:",{"$f":"B4*1.07","v":26.75}]
[null,null,null,"Position:"]
[6]

{"sheet":"Wertart","index":4,"n_rows":6,"n_cols":3,"rows_kept":6,"cut":false,"hidden":true,"merged":[]}
["Wertarten","Vertikales Layout","Horizontales Layout"]
["Anzahl",0,0]
["Anteil - Zellenprozente",1,1]
["Anteil - Zeilenprozente",0,1]
["Anteil - Spaltenprozente",1,0]
["Mittelwert",0,0]

{"sheet":"Metrische Felder","index":5,"n_rows":33,"n_cols":2,"rows_kept":33,"cut":false,"hidden":true,"merged":[]}
["Metrische Felder","nachgelagertes Merkmal"]
["Anbau_flant","1"]
["NRF_2",0]
["f_ant_beheizt","1"]
["AW_flantged_1","1"]
["AW_daemm_staerke_1","1"]
["Fen_flant_neu_1","1"]
["F_flant_1","1"]
["F_flant_2","1"]
["AW_flantged_2","1"]
["AW_daemm_staerke_2","1"]
["Fen_flant_neu_2","1"]
["Putzneu_flant","1"]
["n_OG","1"]
["n_UG","1"]
["fD_ant_kond","1"]
["qd14_1","1"]
["fUG_ant_kond","1"]
["f_ant_belueftet","1"]
["f_ant_gekuehlt","1"]
["geb_f_laenge_n","0"]
["geb_f_laenge_o","0"]
["geb_f_laenge_s","0"]
["geb_f_laenge_w","0"]
["geb_f_hoehe_mittel_iwu","0"]
["geb_f_flaeche_n_iwu","0"]
["geb_f_flaeche_o_iwu","0"]
["geb_f_flaeche_s_iwu","0"]
["geb_f_flaeche_w_iwu","0"]
["geb_flaeche","0"]
["ober_bv_iwu","0"]
["ober_bgf","0"]
["f_fl_geo_iwu","0"]

{"sheet":"Metrische Felder_ALT","index":6,"n_rows":4,"n_cols":1,"rows_kept":4,"cut":false,"hidden":true,"merged":[]}
["Metrische Felder"]
[]
["Dachfläche (m^2)"]
["Wohnfläche (m^2)"]

{"sheet":"Merkmale","index":7,"n_rows":150,"n_cols":3,"rows_kept":150,"cut":false,"hidden":true,"merged":[]}
["Merkmal","Anzahl Ausprägungen","nachgelagertes Merkmal"]
[null,0,0]
["EnEV_rel_NWG_be",2,0]
["NWGrel_gering_beheizt_be",2,0]
["NWGrel_ohneE_be",2,0]
["BAK",12,0]
["q6",2,0]
["Anbau_jk",11,1]
["q10",2,0]
["q11",2,1]
["q12",4,0]
["q14",2,1]
["q15",4,0]
["q16",4,1]
["q27",4,0]
["q27x",8,1]
["q29",4,0]
["q31",5,0]
["q31a",2,1]
["q32_1",2,1]
["q32_2",2,1]
["q32_3",2,1]
["q32_5",2,1]
["q33",4,0]
["q34_1",2,1]
["q34_2",2,1]
["q34_3",2,1]
["thermisch_konditioniert",3,0]
["q35",4,1]
["q37",2,0]
["q38_1",2,1]
["q38_2",2,1]
["q38_3",2,1]
["q38_4",2,1]
["q38_5",2,1]
["q38_6",2,1]
["q38_7",2,1]
["q38_9",2,1]
["q40",2,0]
["q41_1",2,0]
["q41_2",2,0]
["q41_3",2,0]
["q41_4",2,0]
["q41_6",2,0]
["q41_7",2,0]
["q41_8",2,0]
["q41_9",2,0]
["q41_10",2,0]
["q41_11",2,0]
["qb1",3,1]
["qb2",5,1]
["qb3",3,1]
["qb4",4,1]
["AW_daemm_1",2,1]
["AW_djk_1_be",5,1]
["qd1",6,1]
["qd4",2,1]
["qd5",3,1]
["qd5a",6,1]
["Glasart_1",3,1]
["qd7",2,1]
["qd8",6,1]
["qb99",2,1]
["qxb1",3,1]
["qxb2",5,1]
["qxb3",3,1]
["qxb4",4,1]
["AW_daemm_2",2,1]
["AW_djk_2_be",5,1]
["qxd1",6,1]
["qxd4",2,1]
["qxd5",3,1]
["qxd5a",6,1]
["Glasart_2",3,1]
["qxd7",2,1]
["qxd8",6,1]
["Putzneu",2,1]
["q65b0",2,1]
["q67",2,1]
["q68",7,1]
["qc2",6,1]
["qc3",3,1]
["qc4a",8,1]
["qc5",2,1]
["D_nach_djk",4,1]
["Dmod_oD",2,1]
["qc11",5,1]
["qd13",2,1]
["qd16a",2,1]
["qd16",3,1]
["qd16b",6,1]
["D_Fen_glasart",3,1]
["qd18",6,1]
["qe2",3,1]
["qe3",2,1]
["qe4",3,1]
["qe5a",7,1]
["qe6",2,1]
["UG_nach_djk",4,1]
["beheizungsart",4,1]
["energietraeger",9,1]
["w_erz_kat",5,1]
["w_erz_art",20,1]
["qg9",3,1]
["qg10",4,1]
["qg11",6,1]
["qg13",7,1]
["qg14",2,1]
["qg18",4,1]
["qg21",5,1]
["qg21a",2,1]
["qg22",4,1]
["qg23",3,1]
["qg23a",4,1]
["qg25",6,1]
["qg12x1",2,1]
["qg12x2",6,1]
["qh1",3,1]
["qh3_1",2,1]
["qh3_2",2,1]
{"$rows_left_out":31}
{"sheet":"Merkmale_ALT","index":8,"n_rows":6,"n_cols":3,"rows_kept":6,"cut":false,"hidden":true,"merged":[]}
["Merkmal","Anzahl Ausprägungen","Nachgelagert"]
[null,0,0]
["M_1",2,1]
["M_2",3,0]
["M_3",4,0]
["M_4",5,1]

{"sheet":"Merkmalsauspraegungen","index":9,"n_rows":656,"n_cols":2,"rows_kept":656,"cut":false,"hidden":true,"merged":[]}
["Merkmal","Ausprägung"]
["EnEV_rel_NWG_be",0]
["EnEV_rel_NWG_be",1]
["NWGrel_gering_beheizt_be",0]
["NWGrel_gering_beheizt_be",1]
["NWGrel_ohneE_be",0]
["NWGrel_ohneE_be",1]
["BAK","1"]
["BAK","2"]
["BAK","3"]
["BAK","4"]
["BAK","5"]
["BAK","6"]
["BAK","7"]
["BAK","8"]
["BAK","9"]
["BAK","10"]
["BAK","11"]
["BAK","12"]
["q6",0]
["q6","1"]
["Anbau_jk","1"]
["Anbau_jk","2"]
["Anbau_jk","3"]
["Anbau_jk","4"]
["Anbau_jk","5"]
["Anbau_jk","6"]
["Anbau_jk","7"]
["Anbau_jk","8"]
["Anbau_jk","9"]
["Anbau_jk","10"]
["Anbau_jk","11"]
["q10",0]
["q10",1]
["q11",0]
["q11",1]
["q12","1"]
["q12","2"]
["q12","3"]
["q12","4"]
["q14","1"]
["q14","2"]
["q15","1"]
["q15","2"]
["q15","3"]
["q15","4"]
["q16","1"]
["q16","2"]
["q16","3"]
["q16","4"]
["q27","1"]
["q27","2"]
["q27","3"]
["q27","4"]
["q27x","1"]
["q27x","2"]
["q27x","3"]
["q27x","4"]
["q27x","5"]
["q27x","6"]
["q27x","7"]
["q27x","8"]
["q29","1"]
["q29","2"]
["q29","3"]
["q29","4"]
["q31","1"]
["q31","2"]
["q31","3"]
["q31","4"]
["q31","5"]
["q31a",0]
["q31a",1]
["q32_1",0]
["q32_1",1]
["q32_2",0]
["q32_2",1]
["q32_3",0]
["q32_3",1]
["q32_5",0]
["q32_5",1]
["q33","1"]
["q33","2"]
["q33","3"]
["q33","4"]
["q34_1",0]
["q34_1",1]
["q34_2",0]
["q34_2",1]
["q34_3",0]
["q34_3",1]
["thermisch_konditioniert","0"]
["thermisch_konditioniert","1"]
["thermisch_konditioniert","2"]
["q35","1"]
["q35","2"]
["q35","3"]
["q35","4"]
["q37",0]
["q37",1]
["q38_1",0]
["q38_1",1]
["q38_2",0]
["q38_2",1]
["q38_3",0]
["q38_3",1]
["q38_4",0]
["q38_4",1]
["q38_5",0]
["q38_5",1]
["q38_6",0]
["q38_6",1]
["q38_7",0]
["q38_7",1]
["q38_9",0]
["q38_9",1]
["q40",0]
["q40",1]
["q41_1",0]
["q41_1",1]
{"$rows_left_out":537}
{"sheet":"Merkmalsauspraegungen_ALT","index":10,"n_rows":15,"n_cols":2,"rows_kept":15,"cut":false,"hidden":true,"merged":[]}
["Merkmal","Ausprägungen"]
["M_1","A_M_1_1"]
["M_1","A_M_1_2"]
["M_2","A_M_2_1"]
["M_2","A_M_2_2"]
["M_2","A_M_2_3"]
["M_3","A_M_3_1"]
["M_3","A_M_3_2"]
["M_3","A_M_3_3"]
["M_3","A_M_3_4"]
["M_4","A_M_4_1"]
["M_4","A_M_4_2"]
["M_4","A_M_4_3"]
["M_4","A_M_4_4"]
["M_4","A_M_4_5"]

{"sheet":"Filterinterpretation","index":11,"n_rows":8,"n_cols":2,"rows_kept":8,"cut":false,"hidden":true,"merged":[]}
["Filterart"]
[]
["Schnittmenge"]
["Vereinigungsmenge"]
[]
["M_1"]
["M_1","Schnittmenge"]
["M_1","Vereinigungsmenge"]